{"text_format":"1","workbook":"xlsx","n_sheets":7,"sheets":["Scratch Sheet","MiteGamesMatrix","SquirtGamesMatrix","PeeWeeGamesMatrix","BantamGamesMatrix","Combined V3","Teams"],"not_rendered":{"charts":0,"images":20,"macros":1,"external_links":1,"defined_names":35,"comments":0,"pivot_tables":0},"unopened":[],"bounds":{"document_bytes":16777216,"sheet_cells":100000,"rows_first":2000,"rows_last":500,"rows_between":2000,"halvings":0,"cell_chars":16384,"cell_head_chars":4096},"cells_cut":0,"cells_raw":0,"read":"whole","date_system":"1900"}

{"sheet":"Scratch Sheet","index":0,"n_rows":615,"n_cols":13,"rows_kept":615,"cut":false,"hidden":true,"merged":[[4,1,7,1],[9,1,10,1],[12,1,13,1]]}
[]
["SumKrach","KRACH Matrix",{"$f":"C3","v":0.73677581863979857},null,null,{"$f":"C2*F3","v":2.0188002524790734},{"$f":"F2*G3","v":0.7382253482980522},null,null,{"$f":"G2*J3","v":0.11387094682987078}]
[null,0,0.73677581863979857,0,0,2.7400468384074941,0.36567528035104829,0,0,0.15424957581366652]
[null,null,"6:4",null,null,"6:0","2:2",null,null,"5:9"]
[null,"Method 1 Additive",1.5,null,null,6,1,null,null,{"$f":"5/9","v":0.55555555555555558}]
[null,null,1.9945937865236809,null,null,{"$f":"$C$6","v":1.9945937865236809},{"$f":"$C$6","v":1.9945937865236809},null,null,{"$f":"$C$6","v":1.9945937865236809}]
[null,null,0.76923076923076927,{"$f":"C6/C7","v":2.592971922480785},{"$f":"F6/F7","v":2.1608099354006542},0.92307692307692313,1.468,{"$f":"G6/G7","v":1.35871511343575},null,2.335,{"$f":"J6/J7","v":0.85421575439986341}]
[null,null,{"$f":"C5/(C6+C7)","v":0.54272620050245557},null,null,{"$f":"F5/(F6+F7)","v":2.0564349432089721},{"$f":"G5/(G6+G7)","v":0.28880084169617942},null,null,{"$f":"J5/(J6+J7)","v":0.1283158612442537}]
[]
[null,"Divide"]
[null,null,{"$f":"C5/(C6/C7)","v":0.57848678845889645},null,null,{"$f":"F5/(F6/F7)","v":2.7767365846027032},{"$f":"G5/(G6/G7)","v":0.73598945806330529},null,null,{"$f":"J5/(J6/J7)","v":0.65036912828406668}]
[]
[null,"Divide Non multiplicatively",null,null,null,null,null,null,null,{"$f":"SUM(C14:J14)/4","v":1.185395489852243},{"$f":"J13/J6","v":0.5943042126478465}]
[null,null,{"$f":"C11","v":0.57848678845889645},null,null,{"$f":"F11","v":2.7767365846027032},{"$f":"G11","v":0.73598945806330529},null,null,{"$f":"J11","v":0.65036912828406668}]
[]
[]
[null,null,"Iteration 1"]
[null,null,1.5,null,null,6,1,null,null,0.55555555555555558]
[null,null,1.2666666666666666,null,null,1.2666666666666666,1.2666666666666666,null,null,1.2666666666666666]
[null,null,0.76923076923076927,null,null,0.92307692307692313,1.468,null,null,2.335]
{"$rows_left_out":596}
{"sheet":"MiteGamesMatrix","index":1,"n_rows":111,"n_cols":52,"rows_kept":111,"cut":false,"hidden":false,"merged":[]}
["Leave this blank line in here!!!!!"]
["Team","101","102","103","104","105","106","107","108","109","110","111","112","113","114","115","116","117","118","119","120","121","122","123","124","125","126","127","128","129","130","131","132","133","134","135","136","137","138","139","140","141","142","143","144","145","146","151","152"]
["101",null,1,8,11,null,4,6,null,null,null,null,null,null,null,null,null,null,null,null,null,null,null,null,null,null,null,null,null,null,null,null,null,null,null,null,null,null,null,null,null,null,null,null,null,null,null,2,4]
["102",1,null,15,12,null,8,6,9,7,null,null,6,null,null,null,null,null,null,null,null,null,null,null,null,null,null,null,null,null,null,null,null,null,null,null,null,null,null,null,null,null,null,null,null,null,null,null,2]
["103",0,0,null,5,0,0,null,null,null,2,null,8]
["104",3,1,1,null,null,null,1,null,null,2,null,null,2,null,null,null,null,null,null,null,null,null,null,null,null,null,null,null,null,null,null,null,null,null,null,null,null,null,null,null,null,null,null,null,null,null,null,0]
["105",null,null,8,null,null,null,8,2,1,null,null,4]
["106",0,1,16,null,null,null,2,null,13,null,null,null,null,13,null,null,null,null,null,null,null,null,null,null,null,null,null,null,null,null,null,null,null,null,null,null,null,null,null,null,null,null,null,null,null,null,5,7]
["107",2,0,null,4,2,2,null,null,0,4,null,null,null,null,null,7]
["108",null,1,null,null,6,null,null,null,3,4,null,null,null,null,null,6,8]
["109",null,1,null,null,2,1,4,5,null,4,9,3,5,null,null,null,null,null,null,null,null,null,null,null,null,null,null,null,null,null,null,null,null,null,null,null,null,null,null,null,null,null,null,null,null,null,null,2]
["110",null,null,9,3,null,null,4,1,2,null,5,5,8,null,null,null,4]
["111",null,null,null,null,null,null,null,null,2,4,null,4,2,7,null,6,null,null,11]
["112",null,0,9,null,3,null,null,null,4,4,6,null,null,9,null,null,null,null,null,null,null,null,null,null,null,null,null,null,null,null,null,null,null,null,null,null,null,null,null,null,null,null,null,null,null,null,null,0]
["113",null,null,null,6,null,null,null,null,1,4,2,null,null,8,7,4,null,null,null,22]
["114",null,null,null,null,null,1,null,null,null,null,3,3,2,null,null,3,6]
["115",null,null,null,null,null,null,null,null,null,null,null,null,0,null,null,8,3,null,null,null,null,10]
["116",null,null,null,null,null,null,3,7,null,null,4,null,4,7,6,null,null,14,8]
["117",null,null,null,null,null,null,null,0,null,5,null,null,null,4,13,null,null,null,7,16,null,null,null,16]
["118",null,null,null,null,null,null,null,null,null,null,null,null,null,null,null,1,null,null,null,5,2,null,null,null,null,null,null,null,null,null,1]
{"$rows_left_out":92}
{"sheet":"SquirtGamesMatrix","index":2,"n_rows":110,"n_cols":48,"rows_kept":110,"cut":false,"hidden":false,"merged":[]}
["Leave this blank line in here!!!!!"]
["Teams","201","202","203","204","205","206","207","208","209","210","211","212","213","214","215","216","217","218","219","220","221","222","223","224","225","226","227","228","229","230","231","232","233","234","235","236","237","238","239","240","241","242"]
["201",null,11,2,2,12,5,1]
["202",2,null,3,2,7,2,1,6,9,null,null,6]
["203",2,4,null,2,6,6,4,null,null,4,8,6,null,null,10]
["204",3,7,7,null,10,9,7]
["205",2,1,0,0,null,2,null,3]
["206",0,3,2,4,4,null,3,7,null,null,null,null,null,null,6]
["207",4,1,1,1,null,9,null,6,null,null,8]
["208",null,5,null,null,6,5,1,null,4,7,null,null,9,null,null,null,11]
["209",null,3,null,null,null,null,null,3,null,6,0,1,2,5,null,6,null,7]
["210",null,null,0,null,null,null,null,3,6,null,13,1,null,null,9,4,null,null,8]
["211",null,null,3,null,null,null,2,null,10,10,null,5,10,3,6]
["212",null,6,3,null,null,null,null,null,6,8,3,null,4,6,8,null,null,null,null,null,12]
["213",null,null,null,null,null,null,null,2,4,null,0,1,null,1,1,5,null,null,null,null,null,6]
["214",null,null,null,null,null,null,null,null,4,null,5,3,8,null,5,10,null,null,5,9]
["215",null,null,0,null,null,1,null,null,null,3,0,2,3,4,null,6,8]
["216",null,null,null,null,null,null,null,null,0,2,null,null,4,0,1,null,4,8,3,null,null,2]
["217",null,null,null,null,null,null,null,0,null,null,null,null,null,null,0,1,null,6,3,null,null,null,null,null,null,null,null,null,null,11]
["218",null,null,null,null,null,null,null,null,1,null,null,null,null,null,null,3,5,null,2,2,null,null,null,8,null,null,null,null,5]
{"$rows_left_out":91}
{"sheet":"PeeWeeGamesMatrix","index":3,"n_rows":94,"n_cols":40,"rows_kept":94,"cut":false,"hidden":false,"merged":[]}
["Leave this blank line in here!!!!!"]
["Teams","301","302","303","304","305","306","307","308","309","310","311","312","313","314","315","316","317","318","319","320","321","322","323","324","325","326","327","328","329","330","331","332","333","334"]
["301",null,5,2,0,3,null,6,4]
["302",1,null,5,2,2,null,null,3,6,null,7,6,null,null,6]
["303",10,10,null,8,3,7,null,10,null,null,7]
["304",0,4,0,null,null,3,4,null,null,null,5]
["305",1,5,1,null,null,3,6,4,null,8,null,null,null,3,3]
["306",null,null,3,4,3,null,9,2,7,8,6,2]
["307",1,null,null,3,2,1,null,1,7,5,1,3,null,6]
["308",1,6,0,null,2,1,2,null,3,3,2]
["309",null,1,null,null,null,1,4,2,null,2,3,1,null,7,0]
["310",null,null,null,null,4,1,2,2,3,null,0,5,7,null,4,null,null,null,12]
["311",null,3,1,3,null,3,10,2,5,6,null,0,null,null,null,null,null,6]
["312",null,5,null,null,null,1,6,null,3,7,2,null,5,8,null,null,9]
["313",null,null,null,null,null,null,null,null,null,1,null,1,null,3,3,4,7,3,7,7]
["314",null,null,null,null,0,null,3,null,0,null,null,2,2,null,null,5,1,3,null,null,null,null,5]
["315",null,0,null,null,2,null,null,null,6,1,null,null,9,null,null,6,10,8]
["316",null,null,null,null,null,null,null,null,null,null,null,null,0,3,0,null,4,0,2,null,null,null,null,null,1]
["317",null,null,null,null,null,null,null,null,null,null,null,3,0,8,1,3,null,2,4,8,10,7]
["318",null,null,null,null,null,null,null,null,null,null,5,null,1,6,4,10,7,null,8,5,null,null,null,null,null,12]
{"$rows_left_out":75}
{"sheet":"BantamGamesMatrix","index":4,"n_rows":78,"n_cols":32,"rows_kept":78,"cut":false,"hidden":false,"merged":[]}
["Leave this blank line in here!!!!!"]
["Teams","401","402","403","404","405","406","407","408","409","410","411","412","413","414","415","416","417","418","419","420","421","422","423","424","425","426"]
["401",null,5,4,8,3,3,11,null,null,null,8]
["402",0,null,5,1,1,null,4,2,2,4,null,2,2]
["403",2,3,null,2,4,1,null,4,10,9,null,null,7]
["404",2,3,3,null,4,1,5,3,null,5,5,5,4]
["405",5,2,3,8,null,1,6,3,null,null,null,7]
["406",4,null,4,6,2,null,8,3,null,null,2]
["407",1,0,null,2,3,0,null,null,3,7,1,null,3]
["408",null,4,1,1,2,2,null,null,null,4,4,3,null,null,null,null,null,11]
["409",null,0,2,null,null,null,1,null,null,null,1,0,null,1,6,4]
["410",null,1,1,3,null,null,1,1,null,null,1,0,0,2,3,null,null,null,5]
["411",1,null,null,0,null,2,4,1,6,3,null,null,5,1]
["412",null,0,null,2,2,null,null,1,10,10,null,null,7,5,null,null,13]
["413",null,0,1,3,null,null,7,null,null,8,3,1,null,4,8,6]
["414",null,null,null,null,null,null,null,null,8,7,4,2,4,null,10,11,12,null,null,null,null,null,10]
["415",null,null,null,null,null,null,null,null,4,5,null,null,2,1,null,7,8,5,null,null,null,null,null,12]
["416",null,null,null,null,null,null,null,null,2,null,null,null,5,2,5,null,10,6,1,null,8]
["417",null,null,null,null,null,null,null,null,null,null,null,0,null,2,0,2,null,7,7,6,4,10,3]
["418",null,null,null,null,null,null,null,1,null,null,null,null,null,null,0,2,1,null,null,6,2,10,null,null,null,4]
{"$rows_left_out":59}
{"sheet":"Combined V3","index":5,"n_rows":180,"n_cols":22,"rows_kept":180,"cut":false,"hidden":false,"merged":[[5,0,5,2],[41,0,41,2],[86,0,86,2],[127,0,127,2]]}
["2024 V1 published Sunday, Oct 13"]
["V2 published Sunday, Oct 20"]
["V3-Final published Sunday, Oct 27"]
["RPI Score is average of Lodin & Walkush scaled scores"]
[]
["CSHL14U RPI V3",null,null,null,null,null,null,"30 teams"]
[null,null,null,null,null,null,null,"4 levels (AA, A1, A2, A3)"]
[null,null,null,null,null,null,null,"V2 - (8,8,7,7)"]
[null,null,null,null,null,null,null,"V3 - (9,7,8,6)"]
["Lodin Scaled","Walkush Scaled","RPI","Level","Rank Last Week","Rank",null,"TEAM","W","L","T","AGD","SCHED","Lodin Raw Score","Walkush Raw Score",null,"Team","CSHL Rank","MWYH rank","Walkush Rank","Custom","Ordinal"]
[{"$f":" ((N11 - MIN($N$11:$N$40)) / (MAX(N$11:$N$40) - MIN($N$11:$N$40))) * 20","v":20},{"$f":" ((O11 - MIN($O$11:$O$40)) / (MAX($O$11:$O$40) - MIN($O$11:$O$40))) * 20","v":19.981452980524686},{"$f":"(A11+B11)/2","v":19.990726490262343},"AA",{"$f":"VLOOKUP(H11,'[1]Weekly Rankings'!$A$1:$I$150,5,FALSE)","v":1},1,{"$f":"LEFT(H11,3)","v":"401"},"401 Parma B1",5,1,0,4.66,5.72,10.38,{"$f":"VLOOKUP(H11,'[1]JW V3'!$D$1:$F$152,2,FALSE)","v":10.22389492362332},null,{"$f":"LEFT(H11,3)","v":"401"},{"$f":"F11","v":1},{"$f":"RANK(A11,$A$11:$A$40)","v":1},{"$f":"RANK(B11,$B$11:$B$40)","v":2},null,{"$f":"MOD(Q11,100)","v":1}]
[{"$f":" ((N12 - MIN($N$11:$N$40)) / (MAX(N$11:$N$40) - MIN($N$11:$N$40))) * 20","v":19.598393574297191},20,19.799196787148595,"AA",{"$f":"VLOOKUP(H12,'[1]Weekly Rankings'!$A$1:$I$150,5,FALSE)","v":3},2,"402","402 Winterhurst B1",8,1,0,4.55,5.38,9.93,{"$f":"VLOOKUP(H12,'[1]JW V3'!$D$1:$F$152,2,FALSE)","v":10.232453693160426},null,{"$f":"LEFT(H12,3)","v":"402"},{"$f":"F12","v":2},{"$f":"RANK(A12,$A$11:$A$40)","v":2},{"$f":"RANK(B12,$B$11:$B$40)","v":1},null,{"$f":"MOD(Q12,100)","v":2}]
[{"$f":" ((N13 - MIN($N$11:$N$40)) / (MAX(N$11:$N$40) - MIN($N$11:$N$40))) * 20","v":18.830879071842929},19.529619377521826,19.180249224682377,"AA",{"$f":"VLOOKUP(H13,'[1]Weekly Rankings'!$A$1:$I$150,5,FALSE)","v":2},3,"406","406 Shaker B1",6,2,0,3.5,5.57,9.07,{"$f":"VLOOKUP(H13,'[1]JW V3'!$D$1:$F$152,2,FALSE)","v":10.015390280471951},null,"406",3,3,3,null,6]
[{"$f":" ((N14 - MIN($N$11:$N$40)) / (MAX(N$11:$N$40) - MIN($N$11:$N$40))) * 20","v":15.876840696117805},17.780573691281077,16.82870719369944,"AA",{"$f":"VLOOKUP(H14,'[1]Weekly Rankings'!$A$1:$I$150,5,FALSE)","v":4},4,"409","409 No Olmsted B Orange",4,2,1,0.42,5.34,5.76,{"$f":"VLOOKUP(H14,'[1]JW V3'!$D$1:$F$152,2,FALSE)","v":9.2082698178914839},null,"409",4,4,4,null,9]
[{"$f":" ((N15 - MIN($N$11:$N$40)) / (MAX(N$11:$N$40) - MIN($N$11:$N$40))) * 20","v":15.707273538598841},17.261033733677223,16.484153636138032,"AA",{"$f":"VLOOKUP(H15,'[1]Weekly Rankings'!$A$1:$I$150,5,FALSE)","v":5},5,"411","411 Elyria B1",3,3,1,-1,6.57,5.57,{"$f":"VLOOKUP(H15,'[1]JW V3'!$D$1:$F$152,2,FALSE)","v":8.9685211742688384},null,"411",5,5,6,null,11]
[{"$f":" ((N16 - MIN($N$11:$N$40)) / (MAX(N$11:$N$40) - MIN($N$11:$N$40))) * 20","v":14.97545738509594},17.555404879679703,16.265431132387821,"AA",{"$f":"VLOOKUP(H16,'[1]Weekly Rankings'!$A$1:$I$150,5,FALSE)","v":8},6,"404","404 Canton-Akron B1",3,2,2,-0.71,5.46,4.75,{"$f":"VLOOKUP(H16,'[1]JW V3'!$D$1:$F$152,2,FALSE)","v":9.1043626662326798},null,"404",6,6,5,null,4]
[{"$f":" ((N17 - MIN($N$11:$N$40)) / (MAX(N$11:$N$40) - MIN($N$11:$N$40))) * 20","v":14.136546184738956},16.998875713966463,15.567710949352708,"AA",{"$f":"VLOOKUP(H17,'[1]Weekly Rankings'!$A$1:$I$150,5,FALSE)","v":6},7,"407","407 Tri-County B1",2,6,0,-2.62,6.43,3.81,{"$f":"VLOOKUP(H17,'[1]JW V3'!$D$1:$F$152,2,FALSE)","v":8.8475448591258594},null,"407",7,9,7,null,7]
[{"$f":" ((N18 - MIN($N$11:$N$40)) / (MAX(N$11:$N$40) - MIN($N$11:$N$40))) * 20","v":14.3239625167336},16.518494073123765,15.421228294928682,"AA",{"$f":"VLOOKUP(H18,'[1]Weekly Rankings'!$A$1:$I$150,5,FALSE)","v":7},8,"405","405 Rocky River B1",2,5,0,-1.28,5.3,4.0199999999999996,{"$f":"VLOOKUP(H18,'[1]JW V3'!$D$1:$F$152,2,FALSE)","v":8.6258663431086671},null,"405",8,7,8,null,5]
[{"$f":" ((N19 - MIN($N$11:$N$40)) / (MAX(N$11:$N$40) - MIN($N$11:$N$40))) * 20","v":14.225792057117356},15.630641287707046,14.928216672412201,"AA",{"$f":"VLOOKUP(H19,'[1]Weekly Rankings'!$A$1:$I$150,5,FALSE)","v":9},9,"414","414 Geauga B1",8,3,1,2.5,1.41,3.91,{"$f":"VLOOKUP(H19,'[1]JW V3'!$D$1:$F$152,2,FALSE)","v":8.2161548321365849},null,"414",9,8,9,null,14]
[{"$f":" ((N20 - MIN($N$11:$N$40)) / (MAX(N$11:$N$40) - MIN($N$11:$N$40))) * 20","v":13.565372601517179},14.941940034548422,14.2536563180328,"A1",{"$f":"VLOOKUP(H20,'[1]Weekly Rankings'!$A$1:$I$150,5,FALSE)","v":10},10,"412","412 Cleveland B1",6,2,0,1.25,1.92,3.17,{"$f":"VLOOKUP(H20,'[1]JW V3'!$D$1:$F$152,2,FALSE)","v":7.8983444522237161},null,"412",10,10,11,null,12]
{"$rows_left_out":161}
{"sheet":"Teams","index":6,"n_rows":189,"n_cols":8,"rows_kept":189,"cut":false,"hidden":true,"merged":[]}
["Club","Level","Club#","Division","Team","Head_Coach","email","Phone"]
["Strongsville","M",1,null,"#101","Bob Krosky","robert.krosky@spcorp.com","330-321-1200"]
["Parma","M",1,null,"#102","Charlie Petretti","hockeyis4me2@aol.com","330-723-9046"]
["Brooklyn","M",1,null,"#103","Adam Rich","email given is no good","216-351-8195"]
["Rocky River","M",1,null,"#104","Dave Mallett","dmallett@ameritech.net","216-214-4845"]
["Winterhurst","M",1,null,"#105","Joe Geither","joseph.geither@us.abb.com","216-534-1214"]
["Elyria","M",1,null,"#106","Theresa Reid","jtreid@adelphia.net","440-233-4776"]
["Shaker","M",1,null,"#107","Frank Ruane","fruane@olysteel.com"]
["Cleveland Hts.","M",1,null,"#108","Dan Wakefield","dan@drwconsulting.com","216-536-4243"]
["Garfield","M",1,null,"#109","Jen Orlosky","email give is no good","216-883-6355"]
["North Olmsted","M",1,null,"#110","Henry King","hking@peribit.com","440-934-2587"]
["Geauga","M",1,null,"#111","Gary Petre","gpetre@lanly.com","440-543-0333"]
["Parma","M",2,null,"#112","Dennis Blackburn","hockeydriver7840@msn.com","440-845-3646"]
["Rocky River","M",2,null,"#113","Bob Gerlack","gerlack@cox.net","440-331-5607"]
["Tri-County","M",1,null,"#114","Tom Shupe","ktshupe@aol.com","330-297-0253"]
["Strongsville","M",2,null,"#115","Bob Krosky","robert.krosky@spcorp.com","330-321-1200"]
["Columbus","M",1,null,"#116","Mike Lamping","mlamping@champaignbank.com","614-761-2701 "]
["Shaker","M",2,null,"#117","Peter Harrison","peterH@kamansart.com","216-571-6935 "]
["Canton-Akron","M",1,null,"#118","Geoff Bishop","geoff.bishop@timken.com","330-471-7021"]
["Winterhurst","M",2,null,"#119","Rick Thrasher","mi3ninos@hotmail.com","440-967-7083"]
{"$rows_left_out":169}